BDBM141397 US10668051, Compound Example 15::US8921364, 15
SMILES O=C(Nc1ccc(cc1)-n1nc(cc1C1CC1)C1CC1)c1ccncc1
InChI Key InChIKey=XSLDNIVHKPCLEH-UHFFFAOYSA-N
Data  2 IC50
  Tab Delimited (TSV)   2D SDfile   Computed 3D by Vconf -m prep SDfile
Find this compound or compounds like it in BindingDB:
Activity Spreadsheet -- Enzyme Inhibition Constant Data from BindingDB
Found 2 hits for monomerid = 141397
TargetCalcium release-activated calcium channel protein 1(Homo sapiens (Human))
Rhizen Pharmaceuticals
US Patent
LigandPNGBDBM141397(US10668051, Compound Example 15 | US8921364, 15)
Affinity DataIC50:  141nM. Assay description: Inhibition of CRAC channels was determined following thapsigargin (Sigma, Cat #T9033) induced endoplasmic calcium release in Jurkat cells, (see Yasur...
In DepthDetails US Patent
TargetEF-hand calcium-binding domain-containing protein 4B(Homo sapiens (Human))
Rhizen Pharmaceuticals
US Patent
LigandPNGBDBM141397(US10668051, Compound Example 15 | US8921364, 15)
Affinity DataIC50:  141nMT: 2°C. Assay description: Inhibition of CRAC channels was determined following thapsigargin (Sigma, Cat # T9033) induced endoplasmic calcium release in Jurkat cells. (see Yasu...
In DepthDetails US Patent