BDBM141830 US8921397, 72
SMILES CO[C@H]1CC[C@H](CC(=O)N[C@H]2CC[C@H](CCN3CCC(CC3)c3coc4ccccc34)CC2)CC1
InChI Key InChIKey=AKOUANOAMJNPBZ-GJIFKWMDSA-N
Data  3 KI
  Tab Delimited (TSV)   2D SDfile   Computed 3D by Vconf -m prep SDfile
Find this compound or compounds like it in BindingDB:
Activity Spreadsheet -- Enzyme Inhibition Constant Data from BindingDB
Found 3 hits for monomerid = 141830
TargetD(3) dopamine receptor(Homo sapiens (Human))
Hoffmann-La Roche
US Patent
LigandPNGBDBM141830(US8921397, 72)
Affinity DataKi:  3.09nM. Assay description: liquots of membrane preparations were thawed at RT, resuspended in assay buffer (D2, D3: 50 mM Tris-HCl, 120 mM NaCl, 5 mM MgCl2, 1 mM EDTA, 5 mM KC1...
In DepthDetails US Patent
Target5-hydroxytryptamine receptor 2A(Homo sapiens (Human))
Hoffmann-La Roche
US Patent
LigandPNGBDBM141830(US8921397, 72)
Affinity DataKi:  8.14nM. Assay description: liquots of membrane preparations were thawed at RT, resuspended in assay buffer (D2, D3: 50 mM Tris-HCl, 120 mM NaCl, 5 mM MgCl2, 1 mM EDTA, 5 mM KC1...
In DepthDetails US Patent
TargetD(2) dopamine receptor(Homo sapiens (Human))
Hoffmann-La Roche
US Patent
LigandPNGBDBM141830(US8921397, 72)
Affinity DataKi:  67.4nM. Assay description: liquots of membrane preparations were thawed at RT, resuspended in assay buffer (D2, D3: 50 mM Tris-HCl, 120 mM NaCl, 5 mM MgCl2, 1 mM EDTA, 5 mM KC1...
In DepthDetails US Patent