BDBM142067 US8933024, 39
SMILES Cc1cccc(C)c1CNC(=O)n1sc2ncccc2c1=O
InChI Key InChIKey=PWZMFJUOUGZAOX-UHFFFAOYSA-N
Data  1 IC50
  Tab Delimited (TSV)   2D SDfile   Computed 3D by Vconf -m prep SDfile
Find this compound or compounds like it in BindingDB:
Activity Spreadsheet -- Enzyme Inhibition Constant Data from BindingDB
Found 1 hit for monomerid = 142067
TargetEndothelial lipase(Homo sapiens (Human))
Sanofi
US Patent
LigandPNGBDBM142067(US8933024, 39)
Affinity DataIC50:  120nM. Assay description: For characterization of the enzymatic activity of endothelial lipase and the effect of inhibitors, the phospholipase-specific substrate 1,2-bis(4,4-d...
In DepthDetails US Patent