BDBM142092 US11096924, DASH-inhibitors 2401::US11559537, Compound 2401::US8933056, Val-boroPro Thioxamide
SMILES CC(C)[C@H](N)C(=S)N1CCC[C@H]1B(O)O
InChI Key InChIKey=SBBQYCLBXQJVIG-YUMQZZPRSA-N
Data  14 IC50
  Tab Delimited (TSV)   2D SDfile   Computed 3D by Vconf -m prep SDfile
Find this compound or compounds like it in BindingDB:
Activity Spreadsheet -- Enzyme Inhibition Constant Data from BindingDB
Found 14 hits for monomerid = 142092
TargetDipeptidyl peptidase 4(Homo sapiens (Human))
Trustees Of Tufts College
US Patent
LigandPNGBDBM142092(US11096924, DASH-inhibitors 2401 | US11559537, Com...)
Affinity DataIC50:  44nMpH: 2.0Assay Description:The inhibitor solution is prepared by dissolving 3-5 mg of inhibitor in pH 2 solution (0.01 N HCl), such that the concentration of the solution is eq...
In DepthDetails US Patent
TargetDipeptidyl peptidase 4(Homo sapiens (Human))
Trustees Of Tufts College
US Patent
LigandPNGBDBM142092(US11096924, DASH-inhibitors 2401 | US11559537, Com...)
Affinity DataIC50:  5.90E+3nMpH: 8.0Assay Description:The inhibitor solution is prepared by dissolving 3-5 mg of inhibitor in pH 2 solution (0.01 N HCl), such that the concentration of the solution is eq...
In DepthDetails US Patent
TargetDipeptidyl peptidase 8(Homo sapiens (Human))
Trustees Of Tufts College
US Patent
LigandPNGBDBM142092(US11096924, DASH-inhibitors 2401 | US11559537, Com...)
Affinity DataIC50:  4.30E+3nM. Assay description: EnzymesRecombinant human DPPIV (R&D Systems, Cat. No. 1180-SE)Recombinant human DPP8 (Enzo Life Sciences, Cat. No. BML-SE527)Recombinant human DPP9 (...
In DepthDetails US Patent
TargetDipeptidyl peptidase 9(Homo sapiens (Human))
Trustees Of Tufts College
US Patent
LigandPNGBDBM142092(US11096924, DASH-inhibitors 2401 | US11559537, Com...)
Affinity DataIC50:  3.00E+3nM. Assay description: EnzymesRecombinant human DPPIV (R&D Systems, Cat. No. 1180-SE)Recombinant human DPP8 (Enzo Life Sciences, Cat. No. BML-SE527)Recombinant human DPP9 (...
In DepthDetails US Patent
TargetDipeptidyl peptidase 4(Homo sapiens (Human))
Trustees Of Tufts College
US Patent
LigandPNGBDBM142092(US11096924, DASH-inhibitors 2401 | US11559537, Com...)
Affinity DataIC50:  800nM. Assay description: EnzymesRecombinant human DPPIV (R&D Systems, Cat. No. 1180-SE)Recombinant human DPP8 (Enzo Life Sciences, Cat. No. BML-SE527)Recombinant human DPP9 (...
In DepthDetails US Patent
TargetProlyl endopeptidase FAP(Homo sapiens (Human))
Trustees Of Tufts College
US Patent
LigandPNGBDBM142092(US11096924, DASH-inhibitors 2401 | US11559537, Com...)
Affinity DataIC50:  1.00E+5nM. Assay description: EnzymesRecombinant human DPPIV (R&D Systems, Cat. No. 1180-SE)Recombinant human DPP8 (Enzo Life Sciences, Cat. No. BML-SE527)Recombinant human DPP9 (...
In DepthDetails US Patent
TargetDipeptidyl peptidase 8/9(Homo sapiens (Human))
Trustees Of Tufts College
US Patent
LigandPNGBDBM142092(US11096924, DASH-inhibitors 2401 | US11559537, Com...)
Affinity DataIC50:  3.90nM. Assay description: This assay is described in Bachovchin et al. Nature Chemical Biology 10, 656-663 (2014). Briefly, purified enzymes are coupled to Luminex microsphere...
In DepthDetails US Patent
TargetDipeptidyl peptidase 8/9(Homo sapiens (Human))
Trustees Of Tufts College
US Patent
LigandPNGBDBM142092(US11096924, DASH-inhibitors 2401 | US11559537, Com...)
Affinity DataIC50:  3.90E+3nM. Assay description: EnzymesRecombinant human DPPIV (R&D Systems, Cat. No. 1180-SE)Recombinant human DPP8 (Enzo Life Sciences, Cat. No. BML-SE527)Recombinant human DPP9 (...
In DepthDetails US Patent
TargetDipeptidyl peptidase 8(Homo sapiens (Human))
Trustees Of Tufts College
US Patent
LigandPNGBDBM142092(US11096924, DASH-inhibitors 2401 | US11559537, Com...)
Affinity DataIC50:  4.30nM. Assay description: This assay is described in Bachovchin et al. Nature Chemical Biology 10, 656-663 (2014). Briefly, purified enzymes are coupled to Luminex microsphere...
In DepthDetails US Patent
TargetDipeptidyl peptidase 9(Homo sapiens (Human))
Trustees Of Tufts College
US Patent
LigandPNGBDBM142092(US11096924, DASH-inhibitors 2401 | US11559537, Com...)
Affinity DataIC50:  3nM. Assay description: This assay is described in Bachovchin et al. Nature Chemical Biology 10, 656-663 (2014). Briefly, purified enzymes are coupled to Luminex microsphere...
In DepthDetails US Patent
TargetDipeptidyl peptidase 4(Homo sapiens (Human))
Trustees Of Tufts College
US Patent
LigandPNGBDBM142092(US11096924, DASH-inhibitors 2401 | US11559537, Com...)
Affinity DataIC50:  0.800nM. Assay description: This assay is described in Bachovchin et al. Nature Chemical Biology 10, 656-663 (2014). Briefly, purified enzymes are coupled to Luminex microsphere...
In DepthDetails US Patent
TargetProlyl endopeptidase FAP(Homo sapiens (Human))
Trustees Of Tufts College
US Patent
LigandPNGBDBM142092(US11096924, DASH-inhibitors 2401 | US11559537, Com...)
Affinity DataIC50:  100nM. Assay description: This assay is described in Bachovchin et al. Nature Chemical Biology 10, 656-663 (2014). Briefly, purified enzymes are coupled to Luminex microsphere...
In DepthDetails US Patent
TargetProlyl endopeptidase(Homo sapiens (Human))
Trustees Of Tufts College
US Patent
LigandPNGBDBM142092(US11096924, DASH-inhibitors 2401 | US11559537, Com...)
Affinity DataIC50:  1.30E+3nM. Assay description: This assay is described in Bachovchin et al. Nature Chemical Biology 10, 656-663 (2014). Briefly, purified enzymes are coupled to Luminex microsphere...
In DepthDetails US Patent
TargetHomeobox protein PKNOX1(Human)
Trustees Of Tufts College
US Patent
LigandPNGBDBM142092(US11096924, DASH-inhibitors 2401 | US11559537, Com...)
Affinity DataIC50:  1.30E+6nM. Assay description: EnzymesRecombinant human DPPIV (R&D Systems, Cat. No. 1180-SE)Recombinant human DPP8 (Enzo Life Sciences, Cat. No. BML-SE527)Recombinant human DPP9 (...
In DepthDetails US Patent