BDBM142289 US8933099, 55
SMILES CCN1CCN(CCOc2ccc(cc2)C(=O)Nc2cc(Oc3cc4ccn(C(=O)NC)c4cc3OC)ccn2)CC1
InChI Key InChIKey=UXTYUPXFOSHGMU-UHFFFAOYSA-N
Data  1 IC50
  Tab Delimited (TSV)   2D SDfile   Computed 3D by Vconf -m prep SDfile
Find this compound or compounds like it in BindingDB:
Activity Spreadsheet -- Enzyme Inhibition Constant Data from BindingDB
Found 1 hit for monomerid = 142289
TargetFibroblast growth factor receptor 1(Homo sapiens (Human))
Eisai R&D Management
US Patent
LigandPNGBDBM142289(US8933099, 55)
Affinity DataIC50:  34.1nMT: 2°C. Assay description: In this assay, the inhibitory activity of a test substance against the tyrosine kinase activity of FGFR1 protein is measured.To each well of a flat b...
In DepthDetails US Patent