BDBM142331 US8933099, 97
SMILES CCOCCOc1cc2n(ccc2cc1Oc1ccnc(NC(=O)c2ccc(cc2)C2CN(C[C@H](C)O)C2)c1)C(=O)NC
InChI Key InChIKey=KMRDTHLEUZBPGS-NRFANRHFSA-N
Data  1 IC50
  Tab Delimited (TSV)   2D SDfile   Computed 3D by Vconf -m prep SDfile
Find this compound or compounds like it in BindingDB:
Activity Spreadsheet -- Enzyme Inhibition Constant Data from BindingDB
Found 1 hit for monomerid = 142331
TargetFibroblast growth factor receptor 1(Homo sapiens (Human))
Eisai R&D Management
US Patent
LigandPNGBDBM142331(US8933099, 97)
Affinity DataIC50:  7.20nMT: 2°C. Assay description: In this assay, the inhibitory activity of a test substance against the tyrosine kinase activity of FGFR1 protein is measured.To each well of a flat b...
In DepthDetails US Patent