BDBM142450 US8933224, 43
SMILES CC(C)c1nn(C)c2CCN(Cc12)c1ncnn2c(C)nc(-c3ccccc3F)c12
InChI Key InChIKey=IFXJKYPRCPDSHA-UHFFFAOYSA-N
Data  1 IC50
  Tab Delimited (TSV)   2D SDfile   Computed 3D by Vconf -m prep SDfile
Find this compound or compounds like it in BindingDB:
Activity Spreadsheet -- Enzyme Inhibition Constant Data from BindingDB
Found 1 hit for monomerid = 142450
TargetcAMP and cAMP-inhibited cGMP 3',5'-cyclic phosphodiesterase 10A(Rattus norvegicus (rat))
Pfizer
US Patent
LigandPNGBDBM142450(US8933224, 43)
Affinity DataIC50:  0.465nMpH: 7.5Assay Description:The ability of a compound to inhibit PDE10 enzymatic activity can be demonstrated by any number of assays that are known in the art. The products of ...
In DepthDetails US Patent