BDBM142516 US8933224, 109
SMILES Cc1nc(-c2ccccc2F)c2c(ncnn12)N1CCn2ncc(c2C1)C(F)(F)F
InChI Key InChIKey=UFJJAEIFRMPPHX-UHFFFAOYSA-N
Data  1 IC50
  Tab Delimited (TSV)   2D SDfile   Computed 3D by Vconf -m prep SDfile
Find this compound or compounds like it in BindingDB:
Activity Spreadsheet -- Enzyme Inhibition Constant Data from BindingDB
Found 1 hit for monomerid = 142516
TargetcAMP and cAMP-inhibited cGMP 3',5'-cyclic phosphodiesterase 10A(Rattus norvegicus (rat))
Pfizer
US Patent
LigandPNGBDBM142516(US8933224, 109)
Affinity DataIC50:  1.73nMpH: 7.5Assay Description:The ability of a compound to inhibit PDE10 enzymatic activity can be demonstrated by any number of assays that are known in the art. The products of ...
In DepthDetails US Patent