BDBM14265 4-bromo-3-(carboxymethoxy)-5-{4-[(propan-2-ylcarbamoyl)amino]phenyl}thiophene-2-carboxylic acid::Monocyclic thiophene analog 34
SMILES CC(C)NC(=O)Nc1ccc(cc1)-c1sc(C(O)=O)c(OCC(O)=O)c1Br
InChI Key InChIKey=OATSKYKDVWYSQG-UHFFFAOYSA-N
Data  1 KI
  Tab Delimited (TSV)   2D SDfile   Computed 3D by Vconf -m prep SDfile
Find this compound or compounds like it in BindingDB:
Activity Spreadsheet -- Enzyme Inhibition Constant Data from BindingDB
Found 1 hit for monomerid = 14265
TargetTyrosine-protein phosphatase non-receptor type 1 [1-298](Homo sapiens (Human))
Wyeth Research
LigandPNGBDBM14265(4-bromo-3-(carboxymethoxy)-5-{4-[(propan-2-ylcarba...)
Affinity DataKi:  360nM ΔG°:  -8.78kcal/moleT: 2°C. Assay description: The enzymatic assay was carried out at room temperature in 96-well plates. The initial rate of PTPase-catalyzed hydrolysis of p-nitrophenol phosphate...
In DepthDetails ArticlePubMed