BDBM143142 US9682953, 2.A-6
SMILES FC(F)(F)c1ccc(Oc2cccc(C=C3CCC(CC3)NC(=O)c3ccc(nc3)C(F)(F)F)c2)nc1
InChI Key InChIKey=ZCQJIMJJBYXKBJ-VBKFSLOCSA-N
Data  1 IC50
  Tab Delimited (TSV)   2D SDfile   Computed 3D by Vconf -m prep SDfile
Find this compound or compounds like it in BindingDB:
Activity Spreadsheet -- Enzyme Inhibition Constant Data from BindingDB
Found 1 hit for monomerid = 143142
TargetFatty-acid amide hydrolase 1(Homo sapiens (Human))
Advinus Therapeutics
US Patent
LigandPNGBDBM143142(US9682953, 2.A-6)
Affinity DataIC50:  102nMpH: 7.4 T: 2°C. Assay description: All reagents were purchased from Sigma-Aldrich unless specified. Human and Rat Fatty Acid Amide Hydrolase (FAAH) genes used in assay have been descri...
Ligand InfoPC cidPC sid
In DepthDetails US Patent