BDBM143147 US8940739, G-50
SMILES Cn1cc(C(=O)Nc2ccc(nc2)N2CCN(CC2)C2CCCC2)c2cccc(CN3C[C@@H]4N(N(CC=C)CC(=O)N4[C@@H](Cc4ccc(O)cc4)C3=O)C(=O)NCc3ccccc3)c12
InChI Key InChIKey=NNTFXIZLDBUGCH-YMJVKMAGSA-N
Data  1 IC50
  Tab Delimited (TSV)   2D SDfile   Computed 3D by Vconf -m prep SDfile
Find this compound or compounds like it in BindingDB:
Activity Spreadsheet -- Enzyme Inhibition Constant Data from BindingDB
Found 1 hit for monomerid = 143147
TargetCytochrome P450 3A4(Homo sapiens (Human))
Jw Pharmaceutical
US Patent
LigandPNGBDBM143147(US8940739, G-50)
Affinity DataIC50:  1.72E+4nMpH: 7.4Assay Description:This assay was performed in a 200 l volume in 96-well microtiter plates using cDNA-expressed human hepatic CYP3A4 (supersome, BD Gentest #456202). As...
In DepthDetails US Patent