BDBM143285 US9682953, 2.E-23
SMILES Cc1cc(cnc1N)C(=O)NC1CCC(CC1)=Cc1cccc(Oc2ccc(c(C)n2)C(F)(F)F)c1
InChI Key InChIKey=OGAKMOZEPHIDKO-AQTBWJFISA-N
Data  2 IC50
  Tab Delimited (TSV)   2D SDfile   Computed 3D by Vconf -m prep SDfile
Find this compound or compounds like it in BindingDB:
Activity Spreadsheet -- Enzyme Inhibition Constant Data from BindingDB
Found 2 hits for monomerid = 143285
TargetFatty-acid amide hydrolase 1 [30-579](Rattus norvegicus (rat))
Advinus Therapeutics
US Patent
LigandPNGBDBM143285(US9682953, 2.E-23)
Affinity DataIC50:  65nMpH: 7.4 T: 2°C. Assay description: All reagents were purchased from Sigma-Aldrich unless specified. Human and Rat Fatty Acid Amide Hydrolase (FAAH) genes used in assay have been descri...
Ligand InfoPC cidPC sid
In DepthDetails US Patent
TargetFatty-acid amide hydrolase 1(Homo sapiens (Human))
Advinus Therapeutics
US Patent
LigandPNGBDBM143285(US9682953, 2.E-23)
Affinity DataIC50:  12nMpH: 7.4 T: 2°C. Assay description: All reagents were purchased from Sigma-Aldrich unless specified. Human and Rat Fatty Acid Amide Hydrolase (FAAH) genes used in assay have been descri...
Ligand InfoPC cidPC sid
In DepthDetails US Patent