BDBM143301 US9682953, 5.A-2
SMILES FC(F)(F)c1ccc(Oc2cccc(C=C3CCC(CC3)NC(=O)c3ccc(nc3)N3CCCC3)c2)nc1
InChI Key InChIKey=NKNRZHIAQOAWBJ-SILNSSARSA-N
Data  1 IC50
  Tab Delimited (TSV)   2D SDfile   Computed 3D by Vconf -m prep SDfile
Find this compound or compounds like it in BindingDB:
Activity Spreadsheet -- Enzyme Inhibition Constant Data from BindingDB
Found 1 hit for monomerid = 143301
TargetFatty-acid amide hydrolase 1 [30-579](Rattus norvegicus (rat))
Advinus Therapeutics
US Patent
LigandPNGBDBM143301(US9682953, 5.A-2)
Affinity DataIC50:  28nMpH: 7.4 T: 2°C. Assay description: All reagents were purchased from Sigma-Aldrich unless specified. Human and Rat Fatty Acid Amide Hydrolase (FAAH) genes used in assay have been descri...
Ligand InfoPC cidPC sid
In DepthDetails US Patent