BDBM143328 US8940893, 13
SMILES CC#CC(=O)N1CC[C@]2(C[C@@H](C2)n2nc(-c3ccc(Oc4ccccc4)cn3)c3c(N)ncnc23)C1
InChI Key InChIKey=YQPDSRXMSSPWMI-LIZUVYQKSA-N
Data  1 IC50
  Tab Delimited (TSV)   2D SDfile   Computed 3D by Vconf -m prep SDfile
Find this compound or compounds like it in BindingDB:
Activity Spreadsheet -- Enzyme Inhibition Constant Data from BindingDB
Found 1 hit for monomerid = 143328
TargetTyrosine-protein kinase BTK(Homo sapiens (Human))
Boehringer Ingelheim International
US Patent
LigandPNGBDBM143328(US8940893, 13)
Affinity DataIC50:  0.740nM. Assay description: An HTRF assay (Cisbio KinEASE-TK cat #62TKOPEC) was performed to quantitate the ability of test compounds to inhibit BTK mediated phosphorylation of ...
In DepthDetails US Patent