BDBM14339 (2R)-2-(3-{5-[amino(iminiumyl)methyl]-1H-1,3-benzodiazol-2-yl}-5-bromo-4-oxidophenyl)butanedioate::CRA-16847
SMILES NC(=[NH2+])c1ccc2nc([nH]c2c1)-c1cc(cc(Br)c1[O-])[C@@H](CC([O-])=O)C([O-])=O
InChI Key InChIKey=SJMNJNRKVVVGRB-SECBINFHSA-L
Data  5 KI
PDB links: 5 PDB IDs match this monomer.
  Tab Delimited (TSV)   2D SDfile   Computed 3D by Vconf -m prep SDfile
Find this compound or compounds like it in BindingDB:
Activity Spreadsheet -- Enzyme Inhibition Constant Data from BindingDB
Found 5 hits for monomerid = 14339
TargetCoagulation factor X(Homo sapiens (Human))
Celera
LigandPNGBDBM14339((2R)-2-(3-{5-[amino(iminiumyl)methyl]-1H-1,3-benzo...)
Affinity DataKi:  700nM. Assay description: Each enzyme was assayed with a set of different concentrations of each inhibitor. After addition of the appropriate substrate, the rate of hydrolysis...
In DepthDetails ArticlePubMed
TargetUrokinase-type plasminogen activator(Homo sapiens (Human))
Celera
LigandPNGBDBM14339((2R)-2-(3-{5-[amino(iminiumyl)methyl]-1H-1,3-benzo...)
Affinity DataKi:  750nM. Assay description: Each enzyme was assayed with a set of different concentrations of each inhibitor. After addition of the appropriate substrate, the rate of hydrolysis...
In DepthDetails ArticlePubMed
TargetSerine protease 1(Bos taurus (bovine))
Celera
LigandPNGBDBM14339((2R)-2-(3-{5-[amino(iminiumyl)methyl]-1H-1,3-benzo...)
Affinity DataKi:  1.40E+3nM. Assay description: Each enzyme was assayed with a set of different concentrations of each inhibitor. After addition of the appropriate substrate, the rate of hydrolysis...
TargetSerine protease 1(Homo sapiens (Human))
Celera
LigandPNGBDBM14339((2R)-2-(3-{5-[amino(iminiumyl)methyl]-1H-1,3-benzo...)
Affinity DataKi:  7.50E+3nM. Assay description: Each enzyme was assayed with a set of different concentrations of each inhibitor. After addition of the appropriate substrate, the rate of hydrolysis...
In DepthDetails ArticlePubMed
TargetProthrombin(Homo sapiens (Human))
Celera
LigandPNGBDBM14339((2R)-2-(3-{5-[amino(iminiumyl)methyl]-1H-1,3-benzo...)
Affinity DataKi:  4.00E+4nM. Assay description: Each enzyme was assayed with a set of different concentrations of each inhibitor. After addition of the appropriate substrate, the rate of hydrolysis...
In DepthDetails ArticlePubMed