BDBM143772 US10183953, Example 33::US8969352, 33::US9611277, Example 33::US9845333, 33
SMILES Fc1cccc(C(=O)N2CC3CC(Oc4ccc(cn4)C(F)(F)F)C2C3)c1-n1ccnn1
InChI Key InChIKey=RNUWTSJVSRFNSZ-UHFFFAOYSA-N
Data  18 KI
  Tab Delimited (TSV)   2D SDfile   Computed 3D by Vconf -m prep SDfile
Find this compound or compounds like it in BindingDB:
Activity Spreadsheet -- Enzyme Inhibition Constant Data from BindingDB
Found 18 hits for monomerid = 143772
TargetOrexin/Hypocretin receptor type 1(Rattus norvegicus (Rat))
TBA
US Patent
LigandPNGBDBM143772(US10183953, Example 33 | US8969352, 33 | US9611277...)
Affinity DataKi:  74nM. Assay description: Rat and Human Orexin 1 Receptor:Human Embryonic Kidney 293 cells (HEK293) stably expressing rat orexin 1 receptor (Genebank accession number NM_00152...
In DepthDetails US Patent
TargetOrexin/Hypocretin receptor type 1(Rattus norvegicus (Rat))
TBA
US Patent
LigandPNGBDBM143772(US10183953, Example 33 | US8969352, 33 | US9611277...)
Affinity DataKi:  74nM. Assay description: Human Embryonic Kidney 293 cells (HEK293) stably expressing rat orexin 1 receptor (Genebank accession number NM_001525) or Chinese ovary cells (CHO) ...
In DepthDetails US Patent
TargetOrexin/Hypocretin receptor type 1(Rattus norvegicus (Rat))
TBA
US Patent
LigandPNGBDBM143772(US10183953, Example 33 | US8969352, 33 | US9611277...)
Affinity DataKi:  74nM. Assay description: Human Embryonic Kidney 293 cells (HEK293) stably expressing rat orexin 1 receptor (Genebank accession number NM_001525) or Chinese ovary cells (CHO) ...
In DepthDetails US Patent
TargetOrexin/Hypocretin receptor type 1(Rattus norvegicus (Rat))
TBA
US Patent
LigandPNGBDBM143772(US10183953, Example 33 | US8969352, 33 | US9611277...)
Affinity DataKi:  74nM. Assay description: Human Embryonic Kidney 293 cells (HEK293) stably expressing rat orexin 1 receptor (Genebank accession number NM_001525) or Chinese ovary cells (CHO) ...
In DepthDetails US Patent
TargetOrexin/Hypocretin receptor type 1(Rattus norvegicus (Rat))
TBA
US Patent
LigandPNGBDBM143772(US10183953, Example 33 | US8969352, 33 | US9611277...)
Affinity DataKi:  74nM ΔG°:  -9.04kcal/moleT: 2°C. Assay description: Human Embryonic Kidney 293 cells (HEK293) stably expressing rat orexin 1 receptor (Genebank accession number NM 001525) or Chinese ovary cells (CHO) ...
In DepthDetails US Patent
TargetOrexin/Hypocretin receptor type 1(Rattus norvegicus (Rat))
TBA
US Patent
LigandPNGBDBM143772(US10183953, Example 33 | US8969352, 33 | US9611277...)
Affinity DataKi:  74nM. Assay description: Human Embryonic Kidney 293 cells (HEK293) stably expressing rat orexin 1 receptor (Genebank accession number NM_001525) or Chinese ovary cells (CHO) ...
In DepthDetails US Patent
TargetOrexin/Hypocretin receptor type 1(Homo sapiens (Human))
Janssen Pharmaceutica
US Patent
LigandPNGBDBM143772(US10183953, Example 33 | US8969352, 33 | US9611277...)
Affinity DataKi:  86nM. Assay description: HEK293 stably expressing human orexin 2 receptor (Genebank accession number NM_001526) were grown to confluency in DMEM (Hyclone, cat # SH30022), 10%...
In DepthDetails US Patent
TargetOrexin/Hypocretin receptor type 1(Homo sapiens (Human))
Janssen Pharmaceutica
US Patent
LigandPNGBDBM143772(US10183953, Example 33 | US8969352, 33 | US9611277...)
Affinity DataKi:  86nM. Assay description: HEK293 stably expressing human orexin 2 receptor (Genebank accession number NM_001526) were grown to confluency in DMEM (Hyclone, cat # SH30022), 10%...
In DepthDetails US Patent
TargetOrexin/Hypocretin receptor type 1(Homo sapiens (Human))
Janssen Pharmaceutica
US Patent
LigandPNGBDBM143772(US10183953, Example 33 | US8969352, 33 | US9611277...)
Affinity DataKi:  86nM ΔG°:  -8.95kcal/moleT: 2°C. Assay description: Human Embryonic Kidney 293 cells (HEK293) stably expressing rat orexin 1 receptor (Genebank accession number NM 001525) or Chinese ovary cells (CHO) ...
In DepthDetails US Patent
TargetOrexin/Hypocretin receptor type 1(Homo sapiens (Human))
Janssen Pharmaceutica
US Patent
LigandPNGBDBM143772(US10183953, Example 33 | US8969352, 33 | US9611277...)
Affinity DataKi:  86nM. Assay description: Rat and Human Orexin 1 Receptor:Human Embryonic Kidney 293 cells (HEK293) stably expressing rat orexin 1 receptor (Genebank accession number NM_00152...
In DepthDetails US Patent
TargetOrexin/Hypocretin receptor type 1(Homo sapiens (Human))
Janssen Pharmaceutica
US Patent
LigandPNGBDBM143772(US10183953, Example 33 | US8969352, 33 | US9611277...)
Affinity DataKi:  86nM. Assay description: CHO cells stably transfected with the human orexin 1 receptor (Genebank accession number NM_001526) were grown to confluency in DMEM/F12, 10% FBS, 1×...
In DepthDetails US Patent
TargetOrexin/Hypocretin receptor type 1(Homo sapiens (Human))
Janssen Pharmaceutica
US Patent
LigandPNGBDBM143772(US10183953, Example 33 | US8969352, 33 | US9611277...)
Affinity DataKi:  86nM. Assay description: CHO cells stably transfected with the human orexin 1 receptor (Genebank accession number NM_001526) were grown to confluency in DMEM/F12, 10% FBS, 1×...
In DepthDetails US Patent
TargetOrexin receptor type 2(Homo sapiens (Human))
Janssen Pharmaceutica
US Patent
LigandPNGBDBM143772(US10183953, Example 33 | US8969352, 33 | US9611277...)
Affinity DataKi:  3.50E+3nM. Assay description: HEK293 stably expressing human orexin 2 receptor (Genebank accession number NM 001526) were grown to confluency in DMEM (Hyclone, cat # SH30022), 10%...
In DepthDetails US Patent
TargetOrexin receptor type 2(Rattus norvegicus (Rat))
TBA
US Patent
LigandPNGBDBM143772(US10183953, Example 33 | US8969352, 33 | US9611277...)
Affinity DataKi:  3.50E+3nM. Assay description: Human Orexin 2 Receptor:HEK293 stably expressing human orexin 2 receptor (Genebank accession number NM_001526) were grown to confluency in DMEM (Hycl...
In DepthDetails US Patent
TargetOrexin receptor type 2(Homo sapiens (Human))
Janssen Pharmaceutica
US Patent
LigandPNGBDBM143772(US10183953, Example 33 | US8969352, 33 | US9611277...)
Affinity DataKi:  3.50E+3nM. Assay description: PFSK-1 cells endogenously expressing the human orexin 2 receptor were grown to confluency in RPMI1640 (Hyclone, cat #30027.02), 10% FBS, 1× pen-strep...
In DepthDetails US Patent
TargetOrexin receptor type 2(Homo sapiens (Human))
Janssen Pharmaceutica
US Patent
LigandPNGBDBM143772(US10183953, Example 33 | US8969352, 33 | US9611277...)
Affinity DataKi:  3.50E+3nM. Assay description: PFSK-1 cells endogenously expressing the human orexin 2 receptor were grown to confluency in RPMI1640 (Hyclone, cat #30027.02), 10% FBS, 1× pen-strep...
In DepthDetails US Patent
TargetOrexin receptor type 2(Homo sapiens (Human))
Janssen Pharmaceutica
US Patent
LigandPNGBDBM143772(US10183953, Example 33 | US8969352, 33 | US9611277...)
Affinity DataKi:  3.50E+3nM. Assay description: HEK293 stably expressing human orexin 2 receptor (Genebank accession number NM_001526) were grown to confluency in DMEM (Hyclone, cat # SH30022), 10%...
In DepthDetails US Patent
TargetOrexin receptor type 2(Homo sapiens (Human))
Janssen Pharmaceutica
US Patent
LigandPNGBDBM143772(US10183953, Example 33 | US8969352, 33 | US9611277...)
Affinity DataKi:  3.50E+3nM. Assay description: HEK293 stably expressing human orexin 2 receptor (Genebank accession number NM_001526) were grown to confluency in DMEM (Hyclone, cat # SH30022), 10%...
In DepthDetails US Patent