BDBM143861 US8969325, 62
SMILES CC1(C)C[C@@H](NC(=O)Nc2ccc3CN(CCO)C(=O)Nc3c2)c2ccc(nc2O1)C(F)(F)F
InChI Key InChIKey=LUODBZIJTPRQNX-MRXNPFEDSA-N
Data  1 IC50
  Tab Delimited (TSV)   2D SDfile   Computed 3D by Vconf -m prep SDfile
Find this compound or compounds like it in BindingDB:
Activity Spreadsheet -- Enzyme Inhibition Constant Data from BindingDB
Found 1 hit for monomerid = 143861
TargetTransient receptor potential cation channel subfamily V member 1(Homo sapiens (Human))
Abbvie
US Patent
LigandPNGBDBM143861(US8969325, 62)
Affinity DataIC50:  1.50E+3nM. Assay description: The cDNA for human TRPV1 (hTRPV1) was isolated by reverse transcriptase-polymerase chain reaction (RT-PCR) from human small intestine poly A+ RNA sup...
In DepthDetails US Patent