BDBM144041 US8969325, 242
SMILES Fc1ccc2OC3(CCC3)C[C@H](NC(=O)Nc3ccc4CCC(=O)Nc4c3)c2c1
InChI Key InChIKey=UNTLHSLTNANOJC-SFHVURJKSA-N
Data  1 IC50
  Tab Delimited (TSV)   2D SDfile   Computed 3D by Vconf -m prep SDfile
Find this compound or compounds like it in BindingDB:
Activity Spreadsheet -- Enzyme Inhibition Constant Data from BindingDB
Found 1 hit for monomerid = 144041
TargetTransient receptor potential cation channel subfamily V member 1(Homo sapiens (Human))
Abbvie
US Patent
LigandPNGBDBM144041(US8969325, 242)
Affinity DataIC50:  86nM. Assay description: The cDNA for human TRPV1 (hTRPV1) was isolated by reverse transcriptase-polymerase chain reaction (RT-PCR) from human small intestine poly A+ RNA sup...
In DepthDetails US Patent