BDBM14420 5-[(4-chlorophenyl)(hydroxy)(1-methyl-1H-imidazol-5-yl)methyl]-3-(3-methoxyphenyl)-1-methyl-2,3-dihydro-1H-1,3-benzodiazol-2-one::benzimidazolone analog 2d
SMILES COc1cccc(c1)-n1c2cc(ccc2n(C)c1=O)C(O)(c1cncn1C)c1ccc(Cl)cc1
InChI Key InChIKey=JLXNKRBNOATJIM-UHFFFAOYSA-N
Data  2 IC50
  Tab Delimited (TSV)   2D SDfile   Computed 3D by Vconf -m prep SDfile
Find this compound or compounds like it in BindingDB:
Activity Spreadsheet -- Enzyme Inhibition Constant Data from BindingDB
Found 2 hits for monomerid = 14420
LigandPNGBDBM14420(5-[(4-chlorophenyl)(hydroxy)(1-methyl-1H-imidazol-...)
Affinity DataIC50: >1.00E+4nM. Assay description: The in vitro activity of compounds inhibiting GGTase-1 was determined by measuring the transfer of [3H]-geranylgeranylpyrophosphate to substrate Ha-R...
In DepthDetails ArticlePubMed
LigandPNGBDBM14420(5-[(4-chlorophenyl)(hydroxy)(1-methyl-1H-imidazol-...)
Affinity DataIC50:  6.70nMpH: 7.5 T: 2°C. Assay description: The in vitro activity of compounds inhibiting FTase was determined by measuring the transfer of [3H]-FPP to substrate Ha-Ras-CVLS. The incorporated r...
In DepthDetails ArticlePubMed