BDBM144293 US8969336, 377
SMILES CCc1nc(C(N)=O)c(Nc2ccc(N3CCN(C)CC3)c(C)c2)nc1N[C@H]1CC[C@H](O)CC1
InChI Key InChIKey=AUNRSLVYZRNBRS-UAPYVXQJSA-N
Data  1 IC50
  Tab Delimited (TSV)   2D SDfile   Computed 3D by Vconf -m prep SDfile
Find this compound or compounds like it in BindingDB:
Activity Spreadsheet -- Enzyme Inhibition Constant Data from BindingDB
Found 1 hit for monomerid = 144293
TargetTyrosine-protein kinase receptor(Homo sapiens (Human))
Astellas Pharma
US Patent
LigandPNGBDBM144293(US8969336, 377)
Affinity DataIC50:  0.240nM. Assay description: A recombinant retrovirus was created from expression plasmid FLAG-EML4-ALKv1/pMX-iresCD8 in which cDNA for EMLA-ALK fusion protein v1 was integrated,...
In DepthDetails US Patent