BDBM144547 US8969568, 100
SMILES COc1ccc(cc1OC)-c1cc2ncccc2c(OC(CC(C)C)[C@H]2CNC(=O)C2)n1
InChI Key InChIKey=JCFCAGMVCDBUGQ-PLEWWHCXSA-N
Data  1 IC50
  Tab Delimited (TSV)   2D SDfile   Computed 3D by Vconf -m prep SDfile
Find this compound or compounds like it in BindingDB:
Activity Spreadsheet -- Enzyme Inhibition Constant Data from BindingDB
Found 1 hit for monomerid = 144547
TargetTyrosine-protein kinase SYK(Homo sapiens (Human))
Boehringer Ingelheim Pharma
US Patent
LigandPNGBDBM144547(US8969568, 100)
Affinity DataIC50:  7.30nM. Assay description: Recombinant human Syk (amino acids 342-635) was expressed as a fusion protein with an N-terminal GST tag, affinity-purified and deep-frozen at a conc...
In DepthDetails US Patent