BDBM144615 US8969586, 4::US9598436, 4
SMILES Cc1ncncc1-c1cccc2c(noc12)-c1ccccc1
InChI Key InChIKey=RXIZMAUSOHFMGI-UHFFFAOYSA-N
Data  2 IC50
  Tab Delimited (TSV)   2D SDfile   Computed 3D by Vconf -m prep SDfile
Find this compound or compounds like it in BindingDB:
Activity Spreadsheet -- Enzyme Inhibition Constant Data from BindingDB
Found 2 hits for monomerid = 144615
TargetSteroid 17-alpha-hydroxylase/17,20 lyase(Homo sapiens (Human))
Bristol-Myers Squibb
US Patent
LigandPNGBDBM144615(US8969586, 4 | US9598436, 4)
Affinity DataIC50:  357nM. Assay description: The assays were performed in U-bottom 384-well optiplates. The final assay volume was 15 μl prepared from 7.5 μl additions of microsomes (p...
In DepthDetails US Patent
TargetSteroid 17-alpha-hydroxylase/17,20 lyase(Homo sapiens (Human))
Bristol-Myers Squibb
US Patent
LigandPNGBDBM144615(US8969586, 4 | US9598436, 4)
Affinity DataIC50:  357nMpH: 7.2 T: 2°C. Assay description: The assays were performed in U-bottom 384-well optiplates. The final assay volume was 15 μl prepared from 7.5 μl additions of microsomes (p...
In DepthDetails US Patent