BDBM144862 US8952157, 44::US9303025, 44
SMILES Cc1n[nH]c2cccc(Oc3cc(ccc3C(=O)NS(=O)(=O)c3ccc(NCCCN4CCOCC4)c(c3)[N+]([O-])=O)N3CCN(CC4=C(CC(C)(C)CC4)c4ccc(Cl)cc4)CC3)c12
InChI Key InChIKey=PKQMBONILLGOGB-UHFFFAOYSA-N
Data  2 KI
  Tab Delimited (TSV)   2D SDfile   Computed 3D by Vconf -m prep SDfile
Find this compound or compounds like it in BindingDB:
Activity Spreadsheet -- Enzyme Inhibition Constant Data from BindingDB
Found 2 hits for monomerid = 144862
TargetApoptosis regulator Bcl-2(Homo sapiens (Human))
Abbvie
US Patent
LigandPNGBDBM144862(US8952157, 44 | US9303025, 44)
Affinity DataKi:  0.0360nM ΔG°:  -14.2kcal/moleT: 2°C. Assay description: Representative compounds were serially diluted in dimethyl sulfoxide (DMSO) starting at 50 μM (2× starting concentration; 10% DMSO) and 10 μ...
In DepthDetails US Patent
TargetApoptosis regulator Bcl-2(Homo sapiens (Human))
Abbvie
US Patent
LigandPNGBDBM144862(US8952157, 44 | US9303025, 44)
Affinity DataKi:  0.0360nM ΔG°:  -14.2kcal/moleT: 2°C. Assay description: Representative compounds were serially diluted in dimethyl sulfoxide (DMSO) starting at 50 uM (2x starting concentration; 10% DMSO) and 10 uL were tr...
In DepthDetails US Patent