BDBM14488 5-[4-(dimethylamino)phenyl]-6-{2-[6-(morpholin-4-yl)pyridin-3-yl]ethynyl}pyrimidin-4-amine::CHEMBL216697::[5-(4-(Dimethylamino)phenyl)-6-(6-morpholin-4-ylpyridin-3-ylethynyl)pyrimidin-4-ylamine]::alkynylpyrimidine 2
SMILES CN(C)c1ccc(cc1)-c1c(N)ncnc1C#Cc1ccc(nc1)N1CCOCC1
InChI Key InChIKey=AINVOEOJEKKMKB-UHFFFAOYSA-N
Data  3 IC50
PDB links: 1 PDB ID matches this monomer.
  Tab Delimited (TSV)   2D SDfile   Computed 3D by Vconf -m prep SDfile
Find this compound or compounds like it in BindingDB:
Activity Spreadsheet -- Enzyme Inhibition Constant Data from BindingDB
Found 3 hits for monomerid = 14488
TargetAdenosine kinase(Rattus norvegicus (rat))
Abbott Laboratories
LigandPNGBDBM14488(5-[4-(dimethylamino)phenyl]-6-{2-[6-(morpholin-4-y...)
Affinity DataIC50:  68nMpH: 7.5 T: 2°C. Assay description: ADK activity was monitored by a radiochemical assay, which measures the conversion of radioactive Ado ([U-14C] adenosine or [2-3H] adenosine) to AMP ...
TargetAdenosine kinase(Homo sapiens (Human))
Abbott Laboratories
Curated by ChEMBL
LigandPNGBDBM14488(5-[4-(dimethylamino)phenyl]-6-{2-[6-(morpholin-4-y...)
Affinity DataIC50:  2nM. Assay description: Inhibition of cytosolic adenosine kinase
TargetAdenosine kinase(Homo sapiens (Human))
Abbott Laboratories
Curated by ChEMBL
LigandPNGBDBM14488(5-[4-(dimethylamino)phenyl]-6-{2-[6-(morpholin-4-y...)
Affinity DataIC50:  68nM. Assay description: Inhibition of adenosine kinase in intact cells assessed as adenosine phosphorylation