BDBM144907 US8952157, 89::US9303025, 89
SMILES [O-][N+](=O)c1cc(ccc1NCC1CCOCC1)S(=O)(=O)NC(=O)c1ccc(cc1Oc1cccc(c1)N1CCOCC1)N1CCN(Cc2ccccc2-c2ccc(Cl)cc2)CC1
InChI Key InChIKey=GGIDFUXMKAQKMO-UHFFFAOYSA-N
Data  2 KI
  Tab Delimited (TSV)   2D SDfile   Computed 3D by Vconf -m prep SDfile
Find this compound or compounds like it in BindingDB:
Activity Spreadsheet -- Enzyme Inhibition Constant Data from BindingDB
Found 2 hits for monomerid = 144907
TargetApoptosis regulator Bcl-2(Homo sapiens (Human))
Abbvie
US Patent
LigandPNGBDBM144907(US8952157, 89 | US9303025, 89)
Affinity DataKi:  6.11nM ΔG°:  -11.2kcal/moleT: 2°C. Assay description: Representative compounds were serially diluted in dimethyl sulfoxide (DMSO) starting at 50 μM (2× starting concentration; 10% DMSO) and 10 μ...
In DepthDetails US Patent
TargetApoptosis regulator Bcl-2(Homo sapiens (Human))
Abbvie
US Patent
LigandPNGBDBM144907(US8952157, 89 | US9303025, 89)
Affinity DataKi:  6.11nM ΔG°:  -11.2kcal/moleT: 2°C. Assay description: Representative compounds were serially diluted in dimethyl sulfoxide (DMSO) starting at 50 uM (2x starting concentration; 10% DMSO) and 10 uL were tr...
In DepthDetails US Patent