BDBM145112 US8952157, 303::US8952157, 304::US9303025, 303
SMILES CC1(C)CCC(CN2CCN(CC2)c2ccc(C(=O)NS(=O)(=O)c3cnc(OCC4CCOCC4)c(Cl)c3)c(Oc3cc4cc[nH]c4cc3F)c2)=C(C1)c1ccc(Cl)cc1
InChI Key InChIKey=CZSKKIXHKZIIRV-UHFFFAOYSA-N
Data  3 KI
  Tab Delimited (TSV)   2D SDfile   Computed 3D by Vconf -m prep SDfile
Find this compound or compounds like it in BindingDB:
Activity Spreadsheet -- Enzyme Inhibition Constant Data from BindingDB
Found 3 hits for monomerid = 145112
TargetApoptosis regulator Bcl-2(Homo sapiens (Human))
Abbvie
US Patent
LigandPNGBDBM145112(US8952157, 303 | US8952157, 304 | US9303025, 303)
Affinity DataKi:  0.0920nM ΔG°:  -13.7kcal/moleT: 2°C. Assay description: Representative compounds were serially diluted in dimethyl sulfoxide (DMSO) starting at 50 uM (2x starting concentration; 10% DMSO) and 10 uL were tr...
In DepthDetails US Patent
TargetApoptosis regulator Bcl-2(Homo sapiens (Human))
Abbvie
US Patent
LigandPNGBDBM145112(US8952157, 303 | US8952157, 304 | US9303025, 303)
Affinity DataKi:  0.0920nM ΔG°:  -13.7kcal/moleT: 2°C. Assay description: Representative compounds were serially diluted in dimethyl sulfoxide (DMSO) starting at 50 μM (2× starting concentration; 10% DMSO) and 10 μ...
In DepthDetails US Patent
TargetApoptosis regulator Bcl-2(Homo sapiens (Human))
Abbvie
US Patent
LigandPNGBDBM145112(US8952157, 303 | US8952157, 304 | US9303025, 303)
Affinity DataKi:  0.822nM ΔG°:  -12.4kcal/moleT: 2°C. Assay description: Representative compounds were serially diluted in dimethyl sulfoxide (DMSO) starting at 50 uM (2x starting concentration; 10% DMSO) and 10 uL were tr...
In DepthDetails US Patent