BDBM145125 US8952157, 316::US9303025, 316
SMILES CN1CCN(CC1)Nc1ccc(cc1[N+]([O-])=O)S(=O)(=O)NC(=O)c1ccc(cc1Oc1cc2cc[nH]c2cc1F)N1CCN(CC2=C(CC(C)(C)OC2)c2ccc(Cl)cc2)CC1
InChI Key InChIKey=MKXIQUDDQLSHHJ-UHFFFAOYSA-N
Data  2 KI
  Tab Delimited (TSV)   2D SDfile   Computed 3D by Vconf -m prep SDfile
Find this compound or compounds like it in BindingDB:
Activity Spreadsheet -- Enzyme Inhibition Constant Data from BindingDB
Found 2 hits for monomerid = 145125
TargetApoptosis regulator Bcl-2(Homo sapiens (Human))
Abbvie
US Patent
LigandPNGBDBM145125(US8952157, 316 | US9303025, 316)
Affinity DataKi:  0.0580nM ΔG°:  -14.0kcal/moleT: 2°C. Assay description: Representative compounds were serially diluted in dimethyl sulfoxide (DMSO) starting at 50 μM (2× starting concentration; 10% DMSO) and 10 μ...
In DepthDetails US Patent
TargetApoptosis regulator Bcl-2(Homo sapiens (Human))
Abbvie
US Patent
LigandPNGBDBM145125(US8952157, 316 | US9303025, 316)
Affinity DataKi:  0.0580nM ΔG°:  -14.0kcal/moleT: 2°C. Assay description: Representative compounds were serially diluted in dimethyl sulfoxide (DMSO) starting at 50 uM (2x starting concentration; 10% DMSO) and 10 uL were tr...
In DepthDetails US Patent