BDBM145333 US8952169, 112
SMILES CC1(C)[C@@H]2C[C@H]1C(COc1cc(F)c(cc1Cl)C(=O)NS(C)(=O)=O)=CC2
InChI Key InChIKey=HUFDYNAMXWEISF-AAEUAGOBSA-N
Data  1 IC50
  Tab Delimited (TSV)   2D SDfile   Computed 3D by Vconf -m prep SDfile
Find this compound or compounds like it in BindingDB:
Activity Spreadsheet -- Enzyme Inhibition Constant Data from BindingDB
Found 1 hit for monomerid = 145333
TargetSodium channel protein type 9 subunit alpha(Homo sapiens (Human))
Xenon Pharmaceuticals
US Patent
LigandPNGBDBM145333(US8952169, 112)
Affinity DataIC50:  117nMpH: 7.4 T: 2°C. Assay description: Radioligand Binding Studies: Saturation experiments. A representative compound of formula (I) was tritiated. Three tritiums were incorporated in plac...
In DepthDetails US Patent