BDBM145433 US8952169, 212
SMILES CNS(=O)(=O)NC(=O)c1cc(Cl)c(O[C@@H]2C[C@@H]3C[C@@H]3C2)cc1F
InChI Key InChIKey=AHNFDJNPKKFEBR-BRPSZJMVSA-N
Data  1 IC50
  Tab Delimited (TSV)   2D SDfile   Computed 3D by Vconf -m prep SDfile
Find this compound or compounds like it in BindingDB:
Activity Spreadsheet -- Enzyme Inhibition Constant Data from BindingDB
Found 1 hit for monomerid = 145433
TargetSodium channel protein type 9 subunit alpha(Homo sapiens (Human))
Xenon Pharmaceuticals
US Patent
LigandPNGBDBM145433(US8952169, 212)
Affinity DataIC50:  2.30E+3nMpH: 7.4 T: 2°C. Assay description: Radioligand Binding Studies: Saturation experiments. A representative compound of formula (I) was tritiated. Three tritiums were incorporated in plac...
In DepthDetails US Patent