BDBM145443 US8952169, 222
SMILES Fc1cc(OCC23CC4CC(CC(C4)C2)C3)c(I)cc1C(=O)NS(=O)(=O)N1CCC1
InChI Key InChIKey=IDEOFQJJFCWCLD-UHFFFAOYSA-N
Data  1 IC50
  Tab Delimited (TSV)   2D SDfile   Computed 3D by Vconf -m prep SDfile
Find this compound or compounds like it in BindingDB:
Activity Spreadsheet -- Enzyme Inhibition Constant Data from BindingDB
Found 1 hit for monomerid = 145443
TargetSodium channel protein type 9 subunit alpha(Homo sapiens (Human))
Xenon Pharmaceuticals
US Patent
LigandPNGBDBM145443(US8952169, 222)
Affinity DataIC50:  9nMpH: 7.4 T: 2°C. Assay description: Radioligand Binding Studies: Saturation experiments. A representative compound of formula (I) was tritiated. Three tritiums were incorporated in plac...
Ligand InfoPC cidPC sid
In DepthDetails US Patent