BDBM145915 US9682960, EM-9117
SMILES CC1(C)N(CCCOc2ccc(c(F)c2)-c2cc[n+]([O-])cc2)C(=O)N(C1=O)c1ccc(C#N)c(Cl)c1
InChI Key InChIKey=FEYOVKCCESSTQB-UHFFFAOYSA-N
Data  1 IC50
  Tab Delimited (TSV)   2D SDfile   Computed 3D by Vconf -m prep SDfile
Find this compound or compounds like it in BindingDB:
Activity Spreadsheet -- Enzyme Inhibition Constant Data from BindingDB
Found 1 hit for monomerid = 145915
TargetAndrogen receptor(Mus musculus)
Endorecherche
US Patent
LigandPNGBDBM145915(US9682960, EM-9117)
Affinity DataIC50:  31nMpH: 7.4 T: 2°C. Assay description: Androgen binding is measured using the hydroxylapatite (HAP) assay. In brief, the radioactive steroid [3H]R1881 solubilized in ethanol is diluted wit...
Ligand InfoPC cidPC sid
In DepthDetails US Patent