BDBM146058 US8957068, 93
SMILES CC(C)[C@H]1COC(=O)N1c1cc(C)nc(N[C@@H](C)c2ccccc2)n1
InChI Key InChIKey=YURLMTCLTRJEOO-GOEBONIOSA-N
Data  1 IC50
  Tab Delimited (TSV)   2D SDfile   Computed 3D by Vconf -m prep SDfile
Find this compound or compounds like it in BindingDB:
Activity Spreadsheet -- Enzyme Inhibition Constant Data from BindingDB
Found 1 hit for monomerid = 146058
TargetIsocitrate dehydrogenase [NADP] cytoplasmic(Homo sapiens (Human))
Novartis
US Patent
LigandPNGBDBM146058(US8957068, 93)
Affinity DataIC50:  655nMpH: 7.4 T: 2°C. Assay description: Mutant IDH1 R132H catalytic activity was monitored using the quantitative liquid chromatography/mass spectrometry (LC-MS) detection of 2-HG, a produc...
In DepthDetails US Patent