BDBM14613 N-(2-chloro-4-{[(5-cyanopyrazin-2-yl)carbamoyl]amino}-5-methoxyphenyl)pyridine-3-carboxamide::N-pyrazinylurea Analog 8h
SMILES COc1cc(NC(=O)c2cccnc2)c(Cl)cc1NC(=O)Nc1cnc(cn1)C#N
InChI Key InChIKey=UAILGDHTHVVBAD-UHFFFAOYSA-N
Data  1 IC50
  Tab Delimited (TSV)   2D SDfile   Computed 3D by Vconf -m prep SDfile
Find this compound or compounds like it in BindingDB:
Activity Spreadsheet -- Enzyme Inhibition Constant Data from BindingDB
Found 1 hit for monomerid = 14613
TargetSerine/threonine-protein kinase Chk1(Homo sapiens (Human))
Abbott Laboratories
LigandPNGBDBM14613(N-(2-chloro-4-{[(5-cyanopyrazin-2-yl)carbamoyl]ami...)
Affinity DataIC50:  11nMpH: 7.4 T: 2°C. Assay description: Chk1 kinase activity was assayed in reaction buffer containing substrate, enzyme, and inhibitor in the presence of 5uM ATP/[gamma-33P] ATP. 33P incor...
In DepthDetails ArticlePubMed