BDBM146260 US8957068, 312
SMILES CC(C)[C@H]1COC(=O)N1c1nc(N[C@@H](C)c2ccc(CN3C[C@H](C)O[C@H](C)C3)cc2)ncc1F
InChI Key InChIKey=BAJZGHBNJWWTFI-RQXXJAGISA-N
Data  2 IC50
  Tab Delimited (TSV)   2D SDfile   Computed 3D by Vconf -m prep SDfile
Find this compound or compounds like it in BindingDB:
Activity Spreadsheet -- Enzyme Inhibition Constant Data from BindingDB
Found 2 hits for monomerid = 146260
TargetIsocitrate dehydrogenase [NADP] cytoplasmic(Homo sapiens (Human))
Novartis
US Patent
LigandPNGBDBM146260(US8957068, 312)
Affinity DataIC50:  24nMpH: 7.5 T: 2°C. Assay description: The IDH1 (R132H) mutant catalyzes the reduced form of NADP+ (NADPH) and α-ketoglutarate (α-KG) to form nicotinamide adenine dinucleotide ph...
In DepthDetails US Patent
TargetIsocitrate dehydrogenase [NADP] cytoplasmic(Homo sapiens (Human))
Novartis
US Patent
LigandPNGBDBM146260(US8957068, 312)
Affinity DataIC50:  51nMpH: 7.4 T: 2°C. Assay description: Mutant IDH1 R132H catalytic activity was monitored using the quantitative liquid chromatography/mass spectrometry (LC-MS) detection of 2-HG, a produc...
In DepthDetails US Patent