BDBM146307 US8957068, 407::US8957068, 408
SMILES CC(C)[C@H]1COC(=O)N1c1ccnc(NC(C)c2nnc(o2)-c2ccc(F)cc2)n1
InChI Key InChIKey=AUBGVCAXOQPLIS-WPZCJLIBSA-N
Data  3 IC50
  Tab Delimited (TSV)   2D SDfile   Computed 3D by Vconf -m prep SDfile
Find this compound or compounds like it in BindingDB:
Activity Spreadsheet -- Enzyme Inhibition Constant Data from BindingDB
Found 3 hits for monomerid = 146307
TargetIsocitrate dehydrogenase [NADP] cytoplasmic(Homo sapiens (Human))
Novartis
US Patent
LigandPNGBDBM146307(US8957068, 407 | US8957068, 408)
Affinity DataIC50:  237nMpH: 7.4 T: 2°C. Assay description: Mutant IDH1 R132H catalytic activity was monitored using the quantitative liquid chromatography/mass spectrometry (LC-MS) detection of 2-HG, a produc...
In DepthDetails US Patent
TargetIsocitrate dehydrogenase [NADP] cytoplasmic(Homo sapiens (Human))
Novartis
US Patent
LigandPNGBDBM146307(US8957068, 407 | US8957068, 408)
Affinity DataIC50:  349nMpH: 7.5 T: 2°C. Assay description: The IDH1 (R132H) mutant catalyzes the reduced form of NADP+ (NADPH) and α-ketoglutarate (α-KG) to form nicotinamide adenine dinucleotide ph...
In DepthDetails US Patent
TargetIsocitrate dehydrogenase [NADP] cytoplasmic(Homo sapiens (Human))
Novartis
US Patent
LigandPNGBDBM146307(US8957068, 407 | US8957068, 408)
Affinity DataIC50:  6.39E+3nMpH: 7.5 T: 2°C. Assay description: The IDH1 (R132H) mutant catalyzes the reduced form of NADP+ (NADPH) and α-ketoglutarate (α-KG) to form nicotinamide adenine dinucleotide ph...
In DepthDetails US Patent