BDBM146819 US9682960, EM-9180
SMILES CC1(C)N(CCOc2ccc(cc2)-c2cc[n+]([O-])cc2)C(=O)N(C1=O)c1ccc(C#N)c(c1)C(F)(F)F
InChI Key InChIKey=WLCPAHOLUKGJLC-UHFFFAOYSA-N
Data  1 IC50
  Tab Delimited (TSV)   2D SDfile   Computed 3D by Vconf -m prep SDfile
Find this compound or compounds like it in BindingDB:
Activity Spreadsheet -- Enzyme Inhibition Constant Data from BindingDB
Found 1 hit for monomerid = 146819
TargetAndrogen receptor(Mus musculus)
Endorecherche
US Patent
LigandPNGBDBM146819(US9682960, EM-9180)
Affinity DataIC50:  24nMpH: 7.4 T: 2°C. Assay description: Androgen binding is measured using the hydroxylapatite (HAP) assay. In brief, the radioactive steroid [3H]R1881 solubilized in ethanol is diluted wit...
Ligand InfoPC cidPC sid
In DepthDetails US Patent