BDBM146849 US9682960, EM-9201
SMILES Fc1cc(OCCCN2C(=O)N(C(=O)C22CCCC2)c2ccc(C#N)c(Cl)c2)ccc1-c1ccncc1
InChI Key InChIKey=KPGPFBMAPXAIDP-UHFFFAOYSA-N
Data  1 IC50
  Tab Delimited (TSV)   2D SDfile   Computed 3D by Vconf -m prep SDfile
Find this compound or compounds like it in BindingDB:
Activity Spreadsheet -- Enzyme Inhibition Constant Data from BindingDB
Found 1 hit for monomerid = 146849
TargetAndrogen receptor(Mus musculus)
Endorecherche
US Patent
LigandPNGBDBM146849(US9682960, EM-9201)
Affinity DataIC50:  9.70nMpH: 7.4 T: 2°C. Assay description: Androgen binding is measured using the hydroxylapatite (HAP) assay. In brief, the radioactive steroid [3H]R1881 solubilized in ethanol is diluted wit...
Ligand InfoPC cidPC sid
In DepthDetails US Patent