BDBM14685 (cyclohexylmethoxy)(2-formylphenoxy)phosphinic acid::CHEMBL24811::Fragment 15::PAS219::cyclohexylmethyl 2-formylphenyl hydrogen phosphate
SMILES OP(=O)(OCC1CCCCC1)Oc1ccccc1C=O
InChI Key InChIKey=YBEVTZVQKMYQPM-UHFFFAOYSA-N
Data  2 IC50
PDB links: 1 PDB ID matches this monomer.
  Tab Delimited (TSV)   2D SDfile   Computed 3D by Vconf -m prep SDfile
Find this compound or compounds like it in BindingDB:
Activity Spreadsheet -- Enzyme Inhibition Constant Data from BindingDB
Found 2 hits for monomerid = 14685
TargetProto-oncogene tyrosine-protein kinase Src(Homo sapiens (Human))
Aventis Pharma
Curated by ChEMBL
LigandPNGBDBM14685((cyclohexylmethoxy)(2-formylphenoxy)phosphinic aci...)
Affinity DataIC50:  2.30E+6nM. Assay description: The compound was evaluated for its binding affinity towards phosphotyrosine binding pocket of Src protein tryrosine kinase SH2 domain
In DepthDetails ArticlePubMed
TargetProto-oncogene tyrosine-protein kinase Src [145-252](Homo sapiens (Human))
Aventis Pharma
LigandPNGBDBM14685((cyclohexylmethoxy)(2-formylphenoxy)phosphinic aci...)
Affinity DataIC50:  2.30E+6nM. Assay description: SPA uses 125I as energy donor and scintillant-coated beads as energy acceptor. The labeled ligand is captured by the biotinylated Src-SH2 protein imm...