BDBM14695 2-{4-[(2S)-2-acetamido-2-{[(3S)-2-oxo-1-[(4-phenylphenyl)methyl]azepan-3-yl]carbamoyl}ethyl]-2-phosphonophenoxy}acetic acid::Inhibitor 7::RU85493::{4-[(2S)-2-(acetylamino)-3-{[(3S)-1-(biphenyl-4-ylmethyl)-2-oxoazepan-3-yl]amino}-3-oxopropyl]-2-phosphonophenoxy}acetic acid
SMILES CC(=O)N[C@@H](Cc1ccc(OCC(O)=O)c(c1)P(O)(O)=O)C(=O)N[C@H]1CCCCN(Cc2ccc(cc2)-c2ccccc2)C1=O
InChI Key InChIKey=MWEWSHNGVWABKG-SVBPBHIXSA-N
Data  1 IC50
PDB links: 1 PDB ID matches this monomer.
  Tab Delimited (TSV)   2D SDfile   Computed 3D by Vconf -m prep SDfile
Find this compound or compounds like it in BindingDB:
Activity Spreadsheet -- Enzyme Inhibition Constant Data from BindingDB
Found 1 hit for monomerid = 14695
TargetProto-oncogene tyrosine-protein kinase Src [145-252](Homo sapiens (Human))
Aventis Pharma
LigandPNGBDBM14695(2-{4-[(2S)-2-acetamido-2-{[(3S)-2-oxo-1-[(4-phenyl...)
Affinity DataIC50:  437nM. Assay description: SPA uses 125I as energy donor and scintillant-coated beads as energy acceptor. The labeled ligand is captured by the biotinylated Src-SH2 protein imm...
Ligand InfoPC cidPC sidPDB