BDBM147454 US8957093, 309
SMILES CC(C)c1cccc(c1)[C@H](C)NC(=O)c1ccc2n(Cc3ccc(cc3)-c3ccccc3C(=O)NC[C@@H](O)C(=O)N(C)C)c(C)c(C)c2c1
InChI Key InChIKey=MGYJOCPLMCIQNO-MAGLAKDHSA-N
Data  1 IC50
  Tab Delimited (TSV)   2D SDfile   Computed 3D by Vconf -m prep SDfile
Find this compound or compounds like it in BindingDB:
Activity Spreadsheet -- Enzyme Inhibition Constant Data from BindingDB
Found 1 hit for monomerid = 147454
TargetPeroxisome proliferator-activated receptor gamma(Homo sapiens (Human))
The Scripps Research Institute
US Patent
LigandPNGBDBM147454(US8957093, 309)
Affinity DataIC50: >1.00E+3nM. Assay description: The assay was performed according to manufacturer protocol. A mixture of nM GST-PPARG-LBD, 5 nM Tb-GST-antibody, 5 nM Fluormone Pan-PPAR Green, and s...
In DepthDetails US Patent