BDBM147466 US8957219, II-1-190
SMILES COCC(O)CNC(=O)Cc1nc2ccc(cc2s1)-c1ccccc1
InChI Key InChIKey=WZBUNBKEDCWYFZ-UHFFFAOYSA-N
Data  1 IC50
  Tab Delimited (TSV)   2D SDfile   Computed 3D by Vconf -m prep SDfile
Find this compound or compounds like it in BindingDB:
Activity Spreadsheet -- Enzyme Inhibition Constant Data from BindingDB
Found 1 hit for monomerid = 147466
TargetEndothelial lipase(Homo sapiens (Human))
Shionogi
US Patent
LigandPNGBDBM147466(US8957219, II-1-190)
Affinity DataIC50:  2.10E+3nMT: 2°C. Assay description: After the present compound dissolved in DMSO was added to become 0.5% DMSO to the reaction buffer consisting of 20 mM tris hydrochloric acid (pH7.4),...
In DepthDetails US Patent