BDBM148213 US8962630, 21
SMILES CN(C)C(=O)c1cc2cnc(Nc3ccc(cn3)N3CCN(CCCO)CC3)nc2n1C1CCCC1
InChI Key InChIKey=BJQDPHYTYXMTQG-UHFFFAOYSA-N
Data  2 IC50
  Tab Delimited (TSV)   2D SDfile   Computed 3D by Vconf -m prep SDfile
Find this compound or compounds like it in BindingDB:
Activity Spreadsheet -- Enzyme Inhibition Constant Data from BindingDB
Found 2 hits for monomerid = 148213
TargetCyclin-dependent kinase 2(Homo sapiens (Human))
Novartis
US Patent
LigandPNGBDBM148213(US8962630, 21)
Affinity DataIC50: >1.50E+4nM. Assay description: The assay was run under the conditions identical to that for CDK1/cyclin B except 0.25 nM CDK1/cyclin B was replaced with 0.3 nM CDK2/cyclin A. A 384...
In DepthDetails US Patent
TargetCyclin-dependent kinase 1(Homo sapiens (Human))
Novartis
US Patent
LigandPNGBDBM148213(US8962630, 21)
Affinity DataIC50: >1.50E+4nMT: 2°C. Assay description: A 384-well microtiter IMAP-FPT (Molecular Devices Trade Mark Technology) endpoint assay was used for CDK1/cyclin B kinase activity measurements. The ...
In DepthDetails US Patent