BDBM14822 4-[3-(4-amino-1,2,5-oxadiazol-3-yl)-1-propyl-1H-1,2,4-triazol-5-yl]-1,2,5-oxadiazol-3-amine::InterBioScreen compound 9
SMILES CCCn1nc(nc1-c1nonc1N)-c1nonc1N
InChI Key InChIKey=DGIPABZQVBYBEX-UHFFFAOYSA-N
Data  1 IC50
PDB links: 1 PDB ID matches this monomer.
  Tab Delimited (TSV)   2D SDfile   Computed 3D by Vconf -m prep SDfile
Find this compound or compounds like it in BindingDB:
Activity Spreadsheet -- Enzyme Inhibition Constant Data from BindingDB
Found 1 hit for monomerid = 14822
TargetSerine/threonine-protein kinase Chk1(Homo sapiens (Human))
Vernalis (R&D)
LigandPNGBDBM14822(4-[3-(4-amino-1,2,5-oxadiazol-3-yl)-1-propyl-1H-1,...)
Affinity DataIC50:  1.73E+4nMpH: 7.5 T: 2°C. Assay description: Chk1 kinase activity was assayed in reaction buffer containing substrate peptide, enzyme, and inhibitor in the presence of 100uM ATP/[gamma-33P] ATP....