BDBM148305 US9682960, EM-8993
SMILES CN(C)c1ccc(cn1)-c1ccc(OCCCN2C(=S)N(C(=O)C2(C)C)c2ccc(C#N)c(Cl)c2C)cc1
InChI Key InChIKey=ZNPNOFUMAJXTQE-UHFFFAOYSA-N
Data  1 IC50
  Tab Delimited (TSV)   2D SDfile   Computed 3D by Vconf -m prep SDfile
Find this compound or compounds like it in BindingDB:
Activity Spreadsheet -- Enzyme Inhibition Constant Data from BindingDB
Found 1 hit for monomerid = 148305
TargetAndrogen receptor(Mus musculus)
Endorecherche
US Patent
LigandPNGBDBM148305(US9682960, EM-8993)
Affinity DataIC50:  60nMpH: 7.4 T: 2°C. Assay description: Androgen binding is measured using the hydroxylapatite (HAP) assay. In brief, the radioactive steroid [3H]R1881 solubilized in ethanol is diluted wit...
Ligand InfoPC cidPC sid
In DepthDetails US Patent