BDBM14834 1-[5-(2-Hydroxy-1,1-dimethylethyl)-2-p-tolyl-2H-pyrazol-3-yl]-3-[4-(2-morpholin-4-yl-ethoxy)-naphthalen-1-yl]-urea::3-[3-(1-hydroxy-2-methylpropan-2-yl)-1-(4-methylphenyl)-1H-pyrazol-5-yl]-1-{4-[2-(morpholin-4-yl)ethoxy]naphthalen-1-yl}urea::BIRB-796 Analog 11::CHEMBL107850::Dopamine D2 receptor and serotonin 2a receptor::diaryl urea compound 3
SMILES Cc1ccc(cc1)-n1nc(cc1NC(=O)Nc1ccc(OCCN2CCOCC2)c2ccccc12)C(C)(C)CO
InChI Key InChIKey=GPWFFJYJAIOOMC-UHFFFAOYSA-N
Data  3 Kd  2 Koff  1 Kon  1 ITC
  Tab Delimited (TSV)   2D SDfile   Computed 3D by Vconf -m prep SDfile
Find this compound or compounds like it in BindingDB:
Activity Spreadsheet -- Enzyme Inhibition Constant Data from BindingDB
Found 5 hits for monomerid = 14834
TargetMitogen-activated protein kinase 14(Homo sapiens (Human))
Boehringer Ingelheim Pharmaceuticals
LigandPNGBDBM14834(1-[5-(2-Hydroxy-1,1-dimethylethyl)-2-p-tolyl-2H-py...)
Affinity DataKd:  36nMpH: 7.0 T: 2°C. Assay description: The exchange curve assays were run as two half-reactions using an SLM Aminco Bowman Series 2 model SQ-340 fluorescence detector. In the first half re...
In DepthDetails ArticlePubMed
TargetMitogen-activated protein kinase 14(Mus musculus (mouse))
Boehringer Ingelheim Pharmaceuticals
LigandPNGBDBM14834(1-[5-(2-Hydroxy-1,1-dimethylethyl)-2-p-tolyl-2H-py...)
Affinity DataKd:  56nMpH: 7.0 T: 2°C. Assay description: UV thermal melt experiments were carried out in a quartz cuvette loaded with sample containing enzyme and each test compound using a spectrophotomete...
In DepthDetails ArticlePubMed
TargetMitogen-activated protein kinase 14(Homo sapiens (Human))
Boehringer Ingelheim Pharmaceuticals
LigandPNGBDBM14834(1-[5-(2-Hydroxy-1,1-dimethylethyl)-2-p-tolyl-2H-py...)
Affinity DataKon:  0.000400M-1s-1 Koff:  2.54E+4s-1Assay Description:Binding affinity for Mitogen-activated protein kinase p38 alpha
In DepthDetails ArticlePubMed
TargetMitogen-activated protein kinase 14(Homo sapiens (Human))
Boehringer Ingelheim Pharmaceuticals
LigandPNGBDBM14834(1-[5-(2-Hydroxy-1,1-dimethylethyl)-2-p-tolyl-2H-py...)
Affinity DataKd:  16nM. Assay description: Binding affinity for Mitogen-activated protein kinase p38 alpha
In DepthDetails ArticlePubMed
TargetMitogen-activated protein kinase 14(Homo sapiens (Human))
Boehringer Ingelheim Pharmaceuticals
LigandPNGBDBM14834(1-[5-(2-Hydroxy-1,1-dimethylethyl)-2-p-tolyl-2H-py...)
Affinity DataKon:  0.000400M-1s-1Assay Description:Binding affinity for Mitogen-activated protein kinase p38 alpha
In DepthDetails ArticlePubMed
Activity Spreadsheet -- ITC Data from BindingDB
Found 1 hit for monomerid = 14834
CellPNGBDBM14834(1-[5-(2-Hydroxy-1,1-dimethylethyl)-2-p-tolyl-2H-py...)
Boehringer Ingelheim Pharmaceuticals
Syringe5-hydroxytryptamine receptor 2A(Homo sapiens (Human))
ITC DataΔH°: -11.4kcal/mole logk: 5.00E+7
pH: 7.0 T: 25.00°C