BDBM148545 US8962641, 5.1
SMILES CCN(C)c1nccc(n1)N1CCC(C1)Oc1ccc(cc1)[C@H](C)NC(=O)C(F)F
InChI Key InChIKey=YDFLNXJPMADZFZ-MBIQTGHCSA-N
Data  1 IC50
  Tab Delimited (TSV)   2D SDfile   Computed 3D by Vconf -m prep SDfile
Find this compound or compounds like it in BindingDB:
Activity Spreadsheet -- Enzyme Inhibition Constant Data from BindingDB
Found 1 hit for monomerid = 148545
TargetAcetyl-CoA carboxylase 2(Homo sapiens (Human))
Boehringer Ingelheim International
US Patent
LigandPNGBDBM148545(US8962641, 5.1)
Affinity DataIC50:  59nMpH: 7.5Assay Description:Malonyl CoA formation by acetyl CoA carboxylases is stoichometrically linked to the consumption of ATP. ACC2 activity is measured in a NADH-linked ki...
In DepthDetails US Patent