BDBM148671 US8962641, 8.27
SMILES C[C@H](NC(C)=O)c1ccc(O[C@@H]2CCN(C2)c2nc(ncc2F)N(C)CC(F)F)cc1
InChI Key InChIKey=VQHWTJGUNYJHSK-SUMWQHHRSA-N
Data  1 IC50
  Tab Delimited (TSV)   2D SDfile   Computed 3D by Vconf -m prep SDfile
Find this compound or compounds like it in BindingDB:
Activity Spreadsheet -- Enzyme Inhibition Constant Data from BindingDB
Found 1 hit for monomerid = 148671
TargetAcetyl-CoA carboxylase 2(Homo sapiens (Human))
Boehringer Ingelheim International
US Patent
LigandPNGBDBM148671(US8962641, 8.27)
Affinity DataIC50:  65nMpH: 7.5Assay Description:Malonyl CoA formation by acetyl CoA carboxylases is stoichometrically linked to the consumption of ATP. ACC2 activity is measured in a NADH-linked ki...
In DepthDetails US Patent