BDBM148683 US8962641, 8.39
SMILES COc1cccc(c1)N(C)c1nccc(n1)N1CC[C@H](C1)Oc1ccc(cc1)[C@H](C)NC(C)=O
InChI Key InChIKey=DPPFTNSFKDNDRB-MHECFPHRSA-N
Data  1 IC50
  Tab Delimited (TSV)   2D SDfile   Computed 3D by Vconf -m prep SDfile
Find this compound or compounds like it in BindingDB:
Activity Spreadsheet -- Enzyme Inhibition Constant Data from BindingDB
Found 1 hit for monomerid = 148683
TargetAcetyl-CoA carboxylase 2(Homo sapiens (Human))
Boehringer Ingelheim International
US Patent
LigandPNGBDBM148683(US8962641, 8.39)
Affinity DataIC50:  452nMpH: 7.5Assay Description:Malonyl CoA formation by acetyl CoA carboxylases is stoichometrically linked to the consumption of ATP. ACC2 activity is measured in a NADH-linked ki...
In DepthDetails US Patent