BDBM148713 US8962641, 8.70::US8962641, 8.82
SMILES C[C@H](NC(C)=O)c1ccc(O[C@@H]2CCN(C2)c2nc(ncc2F)N2CCC(C)C2)cc1
InChI Key InChIKey=IUCPARGKHKTMBN-XGNAPRINSA-N
Data  2 IC50
  Tab Delimited (TSV)   2D SDfile   Computed 3D by Vconf -m prep SDfile
Find this compound or compounds like it in BindingDB:
Activity Spreadsheet -- Enzyme Inhibition Constant Data from BindingDB
Found 2 hits for monomerid = 148713
TargetAcetyl-CoA carboxylase 2(Homo sapiens (Human))
Boehringer Ingelheim International
US Patent
LigandPNGBDBM148713(US8962641, 8.70 | US8962641, 8.82)
Affinity DataIC50:  180nMpH: 7.5Assay Description:Malonyl CoA formation by acetyl CoA carboxylases is stoichometrically linked to the consumption of ATP. ACC2 activity is measured in a NADH-linked ki...
In DepthDetails US Patent
TargetAcetyl-CoA carboxylase 2(Homo sapiens (Human))
Boehringer Ingelheim International
US Patent
LigandPNGBDBM148713(US8962641, 8.70 | US8962641, 8.82)
Affinity DataIC50:  59nMpH: 7.5Assay Description:Malonyl CoA formation by acetyl CoA carboxylases is stoichometrically linked to the consumption of ATP. ACC2 activity is measured in a NADH-linked ki...
In DepthDetails US Patent