BDBM148855 US8962641, 8.212
SMILES C[C@H](NC(C)=O)c1ccc(O[C@@H]2CCN(C2)c2ncnc(N3CCc4nocc4C3)c2F)cc1
InChI Key InChIKey=DRKNVLACHXBXIM-MGPUTAFESA-N
Data  1 IC50
  Tab Delimited (TSV)   2D SDfile   Computed 3D by Vconf -m prep SDfile
Find this compound or compounds like it in BindingDB:
Activity Spreadsheet -- Enzyme Inhibition Constant Data from BindingDB
Found 1 hit for monomerid = 148855
TargetAcetyl-CoA carboxylase 2(Homo sapiens (Human))
Boehringer Ingelheim International
US Patent
LigandPNGBDBM148855(US8962641, 8.212)
Affinity DataIC50:  998nMpH: 7.5Assay Description:Malonyl CoA formation by acetyl CoA carboxylases is stoichometrically linked to the consumption of ATP. ACC2 activity is measured in a NADH-linked ki...
In DepthDetails US Patent